INFO: Dieses Forum nutzt Cookies...
Cookies sind für den Betrieb des Forums unverzichtbar. Mit der Nutzung des Forums erklärst Du dich damit einverstanden, dass wir Cookies verwenden.

Es wird in jedem Fall ein Cookie gesetzt um diesen Hinweis nicht mehr zu erhalten. Desweiteren setzen wir Google Adsense und Google Analytics ein.

Antwort schreiben 
 
Themabewertung:
  • 0 Bewertungen - 0 im Durchschnitt
  • 1
  • 2
  • 3
  • 4
  • 5
plötzlich merkwürdige Fehlermeldung beim Übersetzen
30.01.2020, 16:20
Beitrag #1
plötzlich merkwürdige Fehlermeldung beim Übersetzen
Moin!

ich habe x-Mal übersetzt und plötzlich kommt folgende Fehlermeldung mit der ich nun gar nichts anfangen kann.

Auch ein Rechnerneustart hat nicht weitergeholfen!

Kann mir einer weiterhelfen?

Gruß Jan

Hier die Meldung:
Zitat:Arduino: 1.8.9 (Windows 10), Board: "Arduino Nano, ATmega328P (Old Bootloader)"

C:\Program Files (x86)\Arduino\arduino-builder -dump-prefs -logger=machine -hardware C:\Program Files (x86)\Arduino\hardware -tools C:\Program Files (x86)\Arduino\tools-builder -tools C:\Program Files (x86)\Arduino\hardware\tools\avr -built-in-libraries C:\Program Files (x86)\Arduino\libraries -libraries C:\Users\XXXXX\Documents\Arduino\libraries -fqbn=arduino:avr:nano:cpu=atmega328old -vid-pid=1A86_7523 -ide-version=10809 -build-path C:\Users\XXXXX\AppData\Local\Temp\arduino_build_601778 -warnings=none -build-cache C:\Users\XXXXX\AppData\Local\Temp\arduino_cache_496984 -prefs=build.warn_data_percentage=75 -prefs=runtime.tools.avr-gcc.path=C:\Program Files (x86)\Arduino\hardware\tools\avr -prefs=runtime.tools.avr-gcc-5.4.0-atmel3.6.1-arduino2.path=C:\Program Files (x86)\Arduino\hardware\tools\avr -prefs=runtime.tools.arduinoOTA.path=C:\Program Files (x86)\Arduino\hardware\tools\avr -prefs=runtime.tools.arduinoOTA-1.2.1.path=C:\Program Files (x86)\Arduino\hardware\tools\avr -prefs=runtime.tools.avrdude.path=C:\Program Files (x86)\Arduino\hardware\tools\avr -prefs=runtime.tools.avrdude-6.3.0-arduino14.path=C:\Program Files (x86)\Arduino\hardware\tools\avr -verbose G:\Modellbahn\Elektronik\Bruhnkarten_Signale\Blocksignal_Bruhnkaten\Blocksignal_​Bruhnkaten.ino
C:\Program Files (x86)\Arduino\arduino-builder -compile -logger=machine -hardware C:\Program Files (x86)\Arduino\hardware -tools C:\Program Files (x86)\Arduino\tools-builder -tools C:\Program Files (x86)\Arduino\hardware\tools\avr -built-in-libraries C:\Program Files (x86)\Arduino\libraries -libraries C:\Users\XXXXX\Documents\Arduino\libraries -fqbn=arduino:avr:nano:cpu=atmega328old -vid-pid=1A86_7523 -ide-version=10809 -build-path C:\Users\XXXXX\AppData\Local\Temp\arduino_build_601778 -warnings=none -build-cache C:\Users\XXXXX\AppData\Local\Temp\arduino_cache_496984 -prefs=build.warn_data_percentage=75 -prefs=runtime.tools.avr-gcc.path=C:\Program Files (x86)\Arduino\hardware\tools\avr -prefs=runtime.tools.avr-gcc-5.4.0-atmel3.6.1-arduino2.path=C:\Program Files (x86)\Arduino\hardware\tools\avr -prefs=runtime.tools.arduinoOTA.path=C:\Program Files (x86)\Arduino\hardware\tools\avr -prefs=runtime.tools.arduinoOTA-1.2.1.path=C:\Program Files (x86)\Arduino\hardware\tools\avr -prefs=runtime.tools.avrdude.path=C:\Program Files (x86)\Arduino\hardware\tools\avr -prefs=runtime.tools.avrdude-6.3.0-arduino14.path=C:\Program Files (x86)\Arduino\hardware\tools\avr -verbose G:\Modellbahn\Elektronik\Bruhnkarten_Signale\Blocksignal_Bruhnkaten\Blocksignal_​Bruhnkaten.ino
Using board 'nano' from platform in folder: C:\Program Files (x86)\Arduino\hardware\arduino\avr
Using core 'arduino' from platform in folder: C:\Program Files (x86)\Arduino\hardware\arduino\avr
Detecting libraries used...
"C:\\Program Files (x86)\\Arduino\\hardware\\tools\\avr/bin/avr-g++" -c -g -Os -w -std=gnu++11 -fpermissive -fno-exceptions -ffunction-sections -fdata-sections -fno-threadsafe-statics -Wno-error=narrowing -flto -w -x c++ -E -CC -mmcu=atmega328p -DF_CPU=16000000L -DARDUINO=10809 -DARDUINO_AVR_NANO -DARDUINO_ARCH_AVR "-IC:\\Program Files (x86)\\Arduino\\hardware\\arduino\\avr\\cores\\arduino" "-IC:\\Program Files (x86)\\Arduino\\hardware\\arduino\\avr\\variants\\eightanaloginputs" "C:\\Users\\XXXXX\\AppData\\Local\\Temp\\arduino_build_601778\\sketch\\Blocksigna​l_Bruhnkaten.ino.cpp" -o nul
"C:\\Program Files (x86)\\Arduino\\hardware\\tools\\avr/bin/avr-g++" -c -g -Os -w -std=gnu++11 -fpermissive -fno-exceptions -ffunction-sections -fdata-sections -fno-threadsafe-statics -Wno-error=narrowing -flto -w -x c++ -E -CC -mmcu=atmega328p -DF_CPU=16000000L -DARDUINO=10809 -DARDUINO_AVR_NANO -DARDUINO_ARCH_AVR "-IC:\\Program Files (x86)\\Arduino\\hardware\\arduino\\avr\\cores\\arduino" "-IC:\\Program Files (x86)\\Arduino\\hardware\\arduino\\avr\\variants\\eightanaloginputs" "-IC:\\Program Files (x86)\\Arduino\\hardware\\arduino\\avr\\libraries\\SoftwareSerial\\src" "C:\\Users\\XXXXX\\AppData\\Local\\Temp\\arduino_build_601778\\sketch\\Blocksigna​l_Bruhnkaten.ino.cpp" -o nul
"C:\\Program Files (x86)\\Arduino\\hardware\\tools\\avr/bin/avr-g++" -c -g -Os -w -std=gnu++11 -fpermissive -fno-exceptions -ffunction-sections -fdata-sections -fno-threadsafe-statics -Wno-error=narrowing -flto -w -x c++ -E -CC -mmcu=atmega328p -DF_CPU=16000000L -DARDUINO=10809 -DARDUINO_AVR_NANO -DARDUINO_ARCH_AVR "-IC:\\Program Files (x86)\\Arduino\\hardware\\arduino\\avr\\cores\\arduino" "-IC:\\Program Files (x86)\\Arduino\\hardware\\arduino\\avr\\variants\\eightanaloginputs" "-IC:\\Program Files (x86)\\Arduino\\hardware\\arduino\\avr\\libraries\\SoftwareSerial\\src" "C:\\Program Files (x86)\\Arduino\\hardware\\arduino\\avr\\libraries\\SoftwareSerial\\src\\Software​Serial.cpp" -o nul
Generating function prototypes...
"C:\\Program Files (x86)\\Arduino\\hardware\\tools\\avr/bin/avr-g++" -c -g -Os -w -std=gnu++11 -fpermissive -fno-exceptions -ffunction-sections -fdata-sections -fno-threadsafe-statics -Wno-error=narrowing -flto -w -x c++ -E -CC -mmcu=atmega328p -DF_CPU=16000000L -DARDUINO=10809 -DARDUINO_AVR_NANO -DARDUINO_ARCH_AVR "-IC:\\Program Files (x86)\\Arduino\\hardware\\arduino\\avr\\cores\\arduino" "-IC:\\Program Files (x86)\\Arduino\\hardware\\arduino\\avr\\variants\\eightanaloginputs" "-IC:\\Program Files (x86)\\Arduino\\hardware\\arduino\\avr\\libraries\\SoftwareSerial\\src" "C:\\Users\\XXXXX\\AppData\\Local\\Temp\\arduino_build_601778\\sketch\\Blocksigna​l_Bruhnkaten.ino.cpp" -o "C:\\Users\\XXXXX\\AppData\\Local\\Temp\\arduino_build_601778\\preproc\\ctags_tar​get_for_gcc_minus_e.cpp"
"C:\\Program Files (x86)\\Arduino\\tools-builder\\ctags\\5.8-arduino11/ctags" -u --language-force=c++ -f - --c++-kinds=svpf --fields=KSTtzns --line-directives "C:\\Users\\XXXXX\\AppData\\Local\\Temp\\arduino_build_601778\\preproc\\ctags_tar​get_for_gcc_minus_e.cpp"
Sketch wird kompiliert...
"C:\\Program Files (x86)\\Arduino\\hardware\\tools\\avr/bin/avr-g++" -c -g -Os -w -std=gnu++11 -fpermissive -fno-exceptions -ffunction-sections -fdata-sections -fno-threadsafe-statics -Wno-error=narrowing -MMD -flto -mmcu=atmega328p -DF_CPU=16000000L -DARDUINO=10809 -DARDUINO_AVR_NANO -DARDUINO_ARCH_AVR "-IC:\\Program Files (x86)\\Arduino\\hardware\\arduino\\avr\\cores\\arduino" "-IC:\\Program Files (x86)\\Arduino\\hardware\\arduino\\avr\\variants\\eightanaloginputs" "-IC:\\Program Files (x86)\\Arduino\\hardware\\arduino\\avr\\libraries\\SoftwareSerial\\src" "C:\\Users\\XXXXX\\AppData\\Local\\Temp\\arduino_build_601778\\sketch\\Blocksigna​l_Bruhnkaten.ino.cpp" -o "C:\\Users\\XXXXX\\AppData\\Local\\Temp\\arduino_build_601778\\sketch\\Blocksigna​l_Bruhnkaten.ino.cpp.o"
Compiling libraries...
Compiling library "SoftwareSerial"
"C:\\Program Files (x86)\\Arduino\\hardware\\tools\\avr/bin/avr-g++" -c -g -Os -w -std=gnu++11 -fpermissive -fno-exceptions -ffunction-sections -fdata-sections -fno-threadsafe-statics -Wno-error=narrowing -MMD -flto -mmcu=atmega328p -DF_CPU=16000000L -DARDUINO=10809 -DARDUINO_AVR_NANO -DARDUINO_ARCH_AVR "-IC:\\Program Files (x86)\\Arduino\\hardware\\arduino\\avr\\cores\\arduino" "-IC:\\Program Files (x86)\\Arduino\\hardware\\arduino\\avr\\variants\\eightanaloginputs" "-IC:\\Program Files (x86)\\Arduino\\hardware\\arduino\\avr\\libraries\\SoftwareSerial\\src" "C:\\Program Files (x86)\\Arduino\\hardware\\arduino\\avr\\libraries\\SoftwareSerial\\src\\Software​Serial.cpp" -o "C:\\Users\\XXXXX\\AppData\\Local\\Temp\\arduino_build_601778\\libraries\\Softwar​eSerial\\SoftwareSerial.cpp.o"
Compiling core...
"C:\\Program Files (x86)\\Arduino\\hardware\\tools\\avr/bin/avr-gcc" -c -g -x assembler-with-cpp -flto -MMD -mmcu=atmega328p -DF_CPU=16000000L -DARDUINO=10809 -DARDUINO_AVR_NANO -DARDUINO_ARCH_AVR "-IC:\\Program Files (x86)\\Arduino\\hardware\\arduino\\avr\\cores\\arduino" "-IC:\\Program Files (x86)\\Arduino\\hardware\\arduino\\avr\\variants\\eightanaloginputs" "C:\\Program Files (x86)\\Arduino\\hardware\\arduino\\avr\\cores\\arduino\\wiring_pulse.S" -o "C:\\Users\\XXXXX\\AppData\\Local\\Temp\\arduino_build_601778\\core\\wiring_pulse​.S.o"
"C:\\Program Files (x86)\\Arduino\\hardware\\tools\\avr/bin/avr-gcc" -c -g -Os -w -std=gnu11 -ffunction-sections -fdata-sections -MMD -flto -fno-fat-lto-objects -mmcu=atmega328p -DF_CPU=16000000L -DARDUINO=10809 -DARDUINO_AVR_NANO -DARDUINO_ARCH_AVR "-IC:\\Program Files (x86)\\Arduino\\hardware\\arduino\\avr\\cores\\arduino" "-IC:\\Program Files (x86)\\Arduino\\hardware\\arduino\\avr\\variants\\eightanaloginputs" "C:\\Program Files (x86)\\Arduino\\hardware\\arduino\\avr\\cores\\arduino\\WInterrupts.c" -o "C:\\Users\\XXXXX\\AppData\\Local\\Temp\\arduino_build_601778\\core\\WInterrupts.​c.o"
"C:\\Program Files (x86)\\Arduino\\hardware\\tools\\avr/bin/avr-gcc" -c -g -Os -w -std=gnu11 -ffunction-sections -fdata-sections -MMD -flto -fno-fat-lto-objects -mmcu=atmega328p -DF_CPU=16000000L -DARDUINO=10809 -DARDUINO_AVR_NANO -DARDUINO_ARCH_AVR "-IC:\\Program Files (x86)\\Arduino\\hardware\\arduino\\avr\\cores\\arduino" "-IC:\\Program Files (x86)\\Arduino\\hardware\\arduino\\avr\\variants\\eightanaloginputs" "C:\\Program Files (x86)\\Arduino\\hardware\\arduino\\avr\\cores\\arduino\\hooks.c" -o "C:\\Users\\XXXXX\\AppData\\Local\\Temp\\arduino_build_601778\\core\\hooks.c.o"
"C:\\Program Files (x86)\\Arduino\\hardware\\tools\\avr/bin/avr-gcc" -c -g -Os -w -std=gnu11 -ffunction-sections -fdata-sections -MMD -flto -fno-fat-lto-objects -mmcu=atmega328p -DF_CPU=16000000L -DARDUINO=10809 -DARDUINO_AVR_NANO -DARDUINO_ARCH_AVR "-IC:\\Program Files (x86)\\Arduino\\hardware\\arduino\\avr\\cores\\arduino" "-IC:\\Program Files (x86)\\Arduino\\hardware\\arduino\\avr\\variants\\eightanaloginputs" "C:\\Program Files (x86)\\Arduino\\hardware\\arduino\\avr\\cores\\arduino\\wiring_analog.c" -o "C:\\Users\\XXXXX\\AppData\\Local\\Temp\\arduino_build_601778\\core\\wiring_analo​g.c.o"
"C:\\Program Files (x86)\\Arduino\\hardware\\tools\\avr/bin/avr-gcc" -c -g -Os -w -std=gnu11 -ffunction-sections -fdata-sections -MMD -flto -fno-fat-lto-objects -mmcu=atmega328p -DF_CPU=16000000L -DARDUINO=10809 -DARDUINO_AVR_NANO -DARDUINO_ARCH_AVR "-IC:\\Program Files (x86)\\Arduino\\hardware\\arduino\\avr\\cores\\arduino" "-IC:\\Program Files (x86)\\Arduino\\hardware\\arduino\\avr\\variants\\eightanaloginputs" "C:\\Program Files (x86)\\Arduino\\hardware\\arduino\\avr\\cores\\arduino\\wiring.c" -o "C:\\Users\\XXXXX\\AppData\\Local\\Temp\\arduino_build_601778\\core\\wiring.c.o"
"C:\\Program Files (x86)\\Arduino\\hardware\\tools\\avr/bin/avr-gcc" -c -g -Os -w -std=gnu11 -ffunction-sections -fdata-sections -MMD -flto -fno-fat-lto-objects -mmcu=atmega328p -DF_CPU=16000000L -DARDUINO=10809 -DARDUINO_AVR_NANO -DARDUINO_ARCH_AVR "-IC:\\Program Files (x86)\\Arduino\\hardware\\arduino\\avr\\cores\\arduino" "-IC:\\Program Files (x86)\\Arduino\\hardware\\arduino\\avr\\variants\\eightanaloginputs" "C:\\Program Files (x86)\\Arduino\\hardware\\arduino\\avr\\cores\\arduino\\wiring_digital.c" -o "C:\\Users\\XXXXX\\AppData\\Local\\Temp\\arduino_build_601778\\core\\wiring_digit​al.c.o"
"C:\\Program Files (x86)\\Arduino\\hardware\\tools\\avr/bin/avr-gcc" -c -g -Os -w -std=gnu11 -ffunction-sections -fdata-sections -MMD -flto -fno-fat-lto-objects -mmcu=atmega328p -DF_CPU=16000000L -DARDUINO=10809 -DARDUINO_AVR_NANO -DARDUINO_ARCH_AVR "-IC:\\Program Files (x86)\\Arduino\\hardware\\arduino\\avr\\cores\\arduino" "-IC:\\Program Files (x86)\\Arduino\\hardware\\arduino\\avr\\variants\\eightanaloginputs" "C:\\Program Files (x86)\\Arduino\\hardware\\arduino\\avr\\cores\\arduino\\wiring_pulse.c" -o "C:\\Users\\XXXXX\\AppData\\Local\\Temp\\arduino_build_601778\\core\\wiring_pulse​.c.o"
"C:\\Program Files (x86)\\Arduino\\hardware\\tools\\avr/bin/avr-gcc" -c -g -Os -w -std=gnu11 -ffunction-sections -fdata-sections -MMD -flto -fno-fat-lto-objects -mmcu=atmega328p -DF_CPU=16000000L -DARDUINO=10809 -DARDUINO_AVR_NANO -DARDUINO_ARCH_AVR "-IC:\\Program Files (x86)\\Arduino\\hardware\\arduino\\avr\\cores\\arduino" "-IC:\\Program Files (x86)\\Arduino\\hardware\\arduino\\avr\\variants\\eightanaloginputs" "C:\\Program Files (x86)\\Arduino\\hardware\\arduino\\avr\\cores\\arduino\\wiring_shift.c" -o "C:\\Users\\XXXXX\\AppData\\Local\\Temp\\arduino_build_601778\\core\\wiring_shift​.c.o"
"C:\\Program Files (x86)\\Arduino\\hardware\\tools\\avr/bin/avr-g++" -c -g -Os -w -std=gnu++11 -fpermissive -fno-exceptions -ffunction-sections -fdata-sections -fno-threadsafe-statics -Wno-error=narrowing -MMD -flto -mmcu=atmega328p -DF_CPU=16000000L -DARDUINO=10809 -DARDUINO_AVR_NANO -DARDUINO_ARCH_AVR "-IC:\\Program Files (x86)\\Arduino\\hardware\\arduino\\avr\\cores\\arduino" "-IC:\\Program Files (x86)\\Arduino\\hardware\\arduino\\avr\\variants\\eightanaloginputs" "C:\\Program Files (x86)\\Arduino\\hardware\\arduino\\avr\\cores\\arduino\\CDC.cpp" -o "C:\\Users\\XXXXX\\AppData\\Local\\Temp\\arduino_build_601778\\core\\CDC.cpp.o"
"C:\\Program Files (x86)\\Arduino\\hardware\\tools\\avr/bin/avr-g++" -c -g -Os -w -std=gnu++11 -fpermissive -fno-exceptions -ffunction-sections -fdata-sections -fno-threadsafe-statics -Wno-error=narrowing -MMD -flto -mmcu=atmega328p -DF_CPU=16000000L -DARDUINO=10809 -DARDUINO_AVR_NANO -DARDUINO_ARCH_AVR "-IC:\\Program Files (x86)\\Arduino\\hardware\\arduino\\avr\\cores\\arduino" "-IC:\\Program Files (x86)\\Arduino\\hardware\\arduino\\avr\\variants\\eightanaloginputs" "C:\\Program Files (x86)\\Arduino\\hardware\\arduino\\avr\\cores\\arduino\\Print.cpp" -o "C:\\Users\\XXXXX\\AppData\\Local\\Temp\\arduino_build_601778\\core\\Print.cpp.o"
"C:\\Program Files (x86)\\Arduino\\hardware\\tools\\avr/bin/avr-g++" -c -g -Os -w -std=gnu++11 -fpermissive -fno-exceptions -ffunction-sections -fdata-sections -fno-threadsafe-statics -Wno-error=narrowing -MMD -flto -mmcu=atmega328p -DF_CPU=16000000L -DARDUINO=10809 -DARDUINO_AVR_NANO -DARDUINO_ARCH_AVR "-IC:\\Program Files (x86)\\Arduino\\hardware\\arduino\\avr\\cores\\arduino" "-IC:\\Program Files (x86)\\Arduino\\hardware\\arduino\\avr\\variants\\eightanaloginputs" "C:\\Program Files (x86)\\Arduino\\hardware\\arduino\\avr\\cores\\arduino\\abi.cpp" -o "C:\\Users\\XXXXX\\AppData\\Local\\Temp\\arduino_build_601778\\core\\abi.cpp.o"
"C:\\Program Files (x86)\\Arduino\\hardware\\tools\\avr/bin/avr-g++" -c -g -Os -w -std=gnu++11 -fpermissive -fno-exceptions -ffunction-sections -fdata-sections -fno-threadsafe-statics -Wno-error=narrowing -MMD -flto -mmcu=atmega328p -DF_CPU=16000000L -DARDUINO=10809 -DARDUINO_AVR_NANO -DARDUINO_ARCH_AVR "-IC:\\Program Files (x86)\\Arduino\\hardware\\arduino\\avr\\cores\\arduino" "-IC:\\Program Files (x86)\\Arduino\\hardware\\arduino\\avr\\variants\\eightanaloginputs" "C:\\Program Files (x86)\\Arduino\\hardware\\arduino\\avr\\cores\\arduino\\IPAddress.cpp" -o "C:\\Users\\XXXXX\\AppData\\Local\\Temp\\arduino_build_601778\\core\\IPAddress.cp​p.o"
"C:\\Program Files (x86)\\Arduino\\hardware\\tools\\avr/bin/avr-g++" -c -g -Os -w -std=gnu++11 -fpermissive -fno-exceptions -ffunction-sections -fdata-sections -fno-threadsafe-statics -Wno-error=narrowing -MMD -flto -mmcu=atmega328p -DF_CPU=16000000L -DARDUINO=10809 -DARDUINO_AVR_NANO -DARDUINO_ARCH_AVR "-IC:\\Program Files (x86)\\Arduino\\hardware\\arduino\\avr\\cores\\arduino" "-IC:\\Program Files (x86)\\Arduino\\hardware\\arduino\\avr\\variants\\eightanaloginputs" "C:\\Program Files (x86)\\Arduino\\hardware\\arduino\\avr\\cores\\arduino\\main.cpp" -o "C:\\Users\\XXXXX\\AppData\\Local\\Temp\\arduino_build_601778\\core\\main.cpp.o"
"C:\\Program Files (x86)\\Arduino\\hardware\\tools\\avr/bin/avr-g++" -c -g -Os -w -std=gnu++11 -fpermissive -fno-exceptions -ffunction-sections -fdata-sections -fno-threadsafe-statics -Wno-error=narrowing -MMD -flto -mmcu=atmega328p -DF_CPU=16000000L -DARDUINO=10809 -DARDUINO_AVR_NANO -DARDUINO_ARCH_AVR "-IC:\\Program Files (x86)\\Arduino\\hardware\\arduino\\avr\\cores\\arduino" "-IC:\\Program Files (x86)\\Arduino\\hardware\\arduino\\avr\\variants\\eightanaloginputs" "C:\\Program Files (x86)\\Arduino\\hardware\\arduino\\avr\\cores\\arduino\\WMath.cpp" -o "C:\\Users\\XXXXX\\AppData\\Local\\Temp\\arduino_build_601778\\core\\WMath.cpp.o"
"C:\\Program Files (x86)\\Arduino\\hardware\\tools\\avr/bin/avr-g++" -c -g -Os -w -std=gnu++11 -fpermissive -fno-exceptions -ffunction-sections -fdata-sections -fno-threadsafe-statics -Wno-error=narrowing -MMD -flto -mmcu=atmega328p -DF_CPU=16000000L -DARDUINO=10809 -DARDUINO_AVR_NANO -DARDUINO_ARCH_AVR "-IC:\\Program Files (x86)\\Arduino\\hardware\\arduino\\avr\\cores\\arduino" "-IC:\\Program Files (x86)\\Arduino\\hardware\\arduino\\avr\\variants\\eightanaloginputs" "C:\\Program Files (x86)\\Arduino\\hardware\\arduino\\avr\\cores\\arduino\\PluggableUSB.cpp" -o "C:\\Users\\XXXXX\\AppData\\Local\\Temp\\arduino_build_601778\\core\\PluggableUSB​.cpp.o"
"C:\\Program Files (x86)\\Arduino\\hardware\\tools\\avr/bin/avr-g++" -c -g -Os -w -std=gnu++11 -fpermissive -fno-exceptions -ffunction-sections -fdata-sections -fno-threadsafe-statics -Wno-error=narrowing -MMD -flto -mmcu=atmega328p -DF_CPU=16000000L -DARDUINO=10809 -DARDUINO_AVR_NANO -DARDUINO_ARCH_AVR "-IC:\\Program Files (x86)\\Arduino\\hardware\\arduino\\avr\\cores\\arduino" "-IC:\\Program Files (x86)\\Arduino\\hardware\\arduino\\avr\\variants\\eightanaloginputs" "C:\\Program Files (x86)\\Arduino\\hardware\\arduino\\avr\\cores\\arduino\\Tone.cpp" -o "C:\\Users\\XXXXX\\AppData\\Local\\Temp\\arduino_build_601778\\core\\Tone.cpp.o"
"C:\\Program Files (x86)\\Arduino\\hardware\\tools\\avr/bin/avr-g++" -c -g -Os -w -std=gnu++11 -fpermissive -fno-exceptions -ffunction-sections -fdata-sections -fno-threadsafe-statics -Wno-error=narrowing -MMD -flto -mmcu=atmega328p -DF_CPU=16000000L -DARDUINO=10809 -DARDUINO_AVR_NANO -DARDUINO_ARCH_AVR "-IC:\\Program Files (x86)\\Arduino\\hardware\\arduino\\avr\\cores\\arduino" "-IC:\\Program Files (x86)\\Arduino\\hardware\\arduino\\avr\\variants\\eightanaloginputs" "C:\\Program Files (x86)\\Arduino\\hardware\\arduino\\avr\\cores\\arduino\\Stream.cpp" -o "C:\\Users\\XXXXX\\AppData\\Local\\Temp\\arduino_build_601778\\core\\Stream.cpp.o​"
"C:\\Program Files (x86)\\Arduino\\hardware\\tools\\avr/bin/avr-g++" -c -g -Os -w -std=gnu++11 -fpermissive -fno-exceptions -ffunction-sections -fdata-sections -fno-threadsafe-statics -Wno-error=narrowing -MMD -flto -mmcu=atmega328p -DF_CPU=16000000L -DARDUINO=10809 -DARDUINO_AVR_NANO -DARDUINO_ARCH_AVR "-IC:\\Program Files (x86)\\Arduino\\hardware\\arduino\\avr\\cores\\arduino" "-IC:\\Program Files (x86)\\Arduino\\hardware\\arduino\\avr\\variants\\eightanaloginputs" "C:\\Program Files (x86)\\Arduino\\hardware\\arduino\\avr\\cores\\arduino\\HardwareSerial.cpp" -o "C:\\Users\\XXXXX\\AppData\\Local\\Temp\\arduino_build_601778\\core\\HardwareSeri​al.cpp.o"
"C:\\Program Files (x86)\\Arduino\\hardware\\tools\\avr/bin/avr-g++" -c -g -Os -w -std=gnu++11 -fpermissive -fno-exceptions -ffunction-sections -fdata-sections -fno-threadsafe-statics -Wno-error=narrowing -MMD -flto -mmcu=atmega328p -DF_CPU=16000000L -DARDUINO=10809 -DARDUINO_AVR_NANO -DARDUINO_ARCH_AVR "-IC:\\Program Files (x86)\\Arduino\\hardware\\arduino\\avr\\cores\\arduino" "-IC:\\Program Files (x86)\\Arduino\\hardware\\arduino\\avr\\variants\\eightanaloginputs" "C:\\Program Files (x86)\\Arduino\\hardware\\arduino\\avr\\cores\\arduino\\new.cpp" -o "C:\\Users\\XXXXX\\AppData\\Local\\Temp\\arduino_build_601778\\core\\new.cpp.o"
"C:\\Program Files (x86)\\Arduino\\hardware\\tools\\avr/bin/avr-g++" -c -g -Os -w -std=gnu++11 -fpermissive -fno-exceptions -ffunction-sections -fdata-sections -fno-threadsafe-statics -Wno-error=narrowing -MMD -flto -mmcu=atmega328p -DF_CPU=16000000L -DARDUINO=10809 -DARDUINO_AVR_NANO -DARDUINO_ARCH_AVR "-IC:\\Program Files (x86)\\Arduino\\hardware\\arduino\\avr\\cores\\arduino" "-IC:\\Program Files (x86)\\Arduino\\hardware\\arduino\\avr\\variants\\eightanaloginputs" "C:\\Program Files (x86)\\Arduino\\hardware\\arduino\\avr\\cores\\arduino\\WString.cpp" -o "C:\\Users\\XXXXX\\AppData\\Local\\Temp\\arduino_build_601778\\core\\WString.cpp.​o"
"C:\\Program Files (x86)\\Arduino\\hardware\\tools\\avr/bin/avr-g++" -c -g -Os -w -std=gnu++11 -fpermissive -fno-exceptions -ffunction-sections -fdata-sections -fno-threadsafe-statics -Wno-error=narrowing -MMD -flto -mmcu=atmega328p -DF_CPU=16000000L -DARDUINO=10809 -DARDUINO_AVR_NANO -DARDUINO_ARCH_AVR "-IC:\\Program Files (x86)\\Arduino\\hardware\\arduino\\avr\\cores\\arduino" "-IC:\\Program Files (x86)\\Arduino\\hardware\\arduino\\avr\\variants\\eightanaloginputs" "C:\\Program Files (x86)\\Arduino\\hardware\\arduino\\avr\\cores\\arduino\\HardwareSerial2.cpp" -o "C:\\Users\\XXXXX\\AppData\\Local\\Temp\\arduino_build_601778\\core\\HardwareSeri​al2.cpp.o"
"C:\\Program Files (x86)\\Arduino\\hardware\\tools\\avr/bin/avr-g++" -c -g -Os -w -std=gnu++11 -fpermissive -fno-exceptions -ffunction-sections -fdata-sections -fno-threadsafe-statics -Wno-error=narrowing -MMD -flto -mmcu=atmega328p -DF_CPU=16000000L -DARDUINO=10809 -DARDUINO_AVR_NANO -DARDUINO_ARCH_AVR "-IC:\\Program Files (x86)\\Arduino\\hardware\\arduino\\avr\\cores\\arduino" "-IC:\\Program Files (x86)\\Arduino\\hardware\\arduino\\avr\\variants\\eightanaloginputs" "C:\\Program Files (x86)\\Arduino\\hardware\\arduino\\avr\\cores\\arduino\\USBCore.cpp" -o "C:\\Users\\XXXXX\\AppData\\Local\\Temp\\arduino_build_601778\\core\\USBCore.cpp.​o"
"C:\\Program Files (x86)\\Arduino\\hardware\\tools\\avr/bin/avr-g++" -c -g -Os -w -std=gnu++11 -fpermissive -fno-exceptions -ffunction-sections -fdata-sections -fno-threadsafe-statics -Wno-error=narrowing -MMD -flto -mmcu=atmega328p -DF_CPU=16000000L -DARDUINO=10809 -DARDUINO_AVR_NANO -DARDUINO_ARCH_AVR "-IC:\\Program Files (x86)\\Arduino\\hardware\\arduino\\avr\\cores\\arduino" "-IC:\\Program Files (x86)\\Arduino\\hardware\\arduino\\avr\\variants\\eightanaloginputs" "C:\\Program Files (x86)\\Arduino\\hardware\\arduino\\avr\\cores\\arduino\\HardwareSerial1.cpp" -o "C:\\Users\\XXXXX\\AppData\\Local\\Temp\\arduino_build_601778\\core\\HardwareSeri​al1.cpp.o"
"C:\\Program Files (x86)\\Arduino\\hardware\\tools\\avr/bin/avr-g++" -c -g -Os -w -std=gnu++11 -fpermissive -fno-exceptions -ffunction-sections -fdata-sections -fno-threadsafe-statics -Wno-error=narrowing -MMD -flto -mmcu=atmega328p -DF_CPU=16000000L -DARDUINO=10809 -DARDUINO_AVR_NANO -DARDUINO_ARCH_AVR "-IC:\\Program Files (x86)\\Arduino\\hardware\\arduino\\avr\\cores\\arduino" "-IC:\\Program Files (x86)\\Arduino\\hardware\\arduino\\avr\\variants\\eightanaloginputs" "C:\\Program Files (x86)\\Arduino\\hardware\\arduino\\avr\\cores\\arduino\\HardwareSerial0.cpp" -o "C:\\Users\\XXXXX\\AppData\\Local\\Temp\\arduino_build_601778\\core\\HardwareSeri​al0.cpp.o"
"C:\\Program Files (x86)\\Arduino\\hardware\\tools\\avr/bin/avr-g++" -c -g -Os -w -std=gnu++11 -fpermissive -fno-exceptions -ffunction-sections -fdata-sections -fno-threadsafe-statics -Wno-error=narrowing -MMD -flto -mmcu=atmega328p -DF_CPU=16000000L -DARDUINO=10809 -DARDUINO_AVR_NANO -DARDUINO_ARCH_AVR "-IC:\\Program Files (x86)\\Arduino\\hardware\\arduino\\avr\\cores\\arduino" "-IC:\\Program Files (x86)\\Arduino\\hardware\\arduino\\avr\\variants\\eightanaloginputs" "C:\\Program Files (x86)\\Arduino\\hardware\\arduino\\avr\\cores\\arduino\\HardwareSerial3.cpp" -o "C:\\Users\\XXXXX\\AppData\\Local\\Temp\\arduino_build_601778\\core\\HardwareSeri​al3.cpp.o"
"C:\\Program Files (x86)\\Arduino\\hardware\\tools\\avr/bin/avr-gcc-ar" rcs "C:\\Users\\XXXXX\\AppData\\Local\\Temp\\arduino_build_601778\\core\\core.a" "C:\\Users\\XXXXX\\AppData\\Local\\Temp\\arduino_build_601778\\core\\CDC.cpp.o"
"C:\\Program Files (x86)\\Arduino\\hardware\\tools\\avr/bin/avr-gcc-ar" rcs "C:\\Users\\XXXXX\\AppData\\Local\\Temp\\arduino_build_601778\\core\\core.a" "C:\\Users\\XXXXX\\AppData\\Local\\Temp\\arduino_build_601778\\core\\HardwareSeri​al.cpp.o"
"C:\\Program Files (x86)\\Arduino\\hardware\\tools\\avr/bin/avr-gcc-ar" rcs "C:\\Users\\XXXXX\\AppData\\Local\\Temp\\arduino_build_601778\\core\\core.a" "C:\\Users\\XXXXX\\AppData\\Local\\Temp\\arduino_build_601778\\core\\HardwareSeri​al0.cpp.o"
"C:\\Program Files (x86)\\Arduino\\hardware\\tools\\avr/bin/avr-gcc-ar" rcs "C:\\Users\\XXXXX\\AppData\\Local\\Temp\\arduino_build_601778\\core\\core.a" "C:\\Users\\XXXXX\\AppData\\Local\\Temp\\arduino_build_601778\\core\\HardwareSeri​al1.cpp.o"
"C:\\Program Files (x86)\\Arduino\\hardware\\tools\\avr/bin/avr-gcc-ar" rcs "C:\\Users\\XXXXX\\AppData\\Local\\Temp\\arduino_build_601778\\core\\core.a" "C:\\Users\\XXXXX\\AppData\\Local\\Temp\\arduino_build_601778\\core\\HardwareSeri​al2.cpp.o"
"C:\\Program Files (x86)\\Arduino\\hardware\\tools\\avr/bin/avr-gcc-ar" rcs "C:\\Users\\XXXXX\\AppData\\Local\\Temp\\arduino_build_601778\\core\\core.a" "C:\\Users\\XXXXX\\AppData\\Local\\Temp\\arduino_build_601778\\core\\HardwareSeri​al3.cpp.o"
"C:\\Program Files (x86)\\Arduino\\hardware\\tools\\avr/bin/avr-gcc-ar" rcs "C:\\Users\\XXXXX\\AppData\\Local\\Temp\\arduino_build_601778\\core\\core.a" "C:\\Users\\XXXXX\\AppData\\Local\\Temp\\arduino_build_601778\\core\\IPAddress.cp​p.o"
"C:\\Program Files (x86)\\Arduino\\hardware\\tools\\avr/bin/avr-gcc-ar" rcs "C:\\Users\\XXXXX\\AppData\\Local\\Temp\\arduino_build_601778\\core\\core.a" "C:\\Users\\XXXXX\\AppData\\Local\\Temp\\arduino_build_601778\\core\\PluggableUSB​.cpp.o"
"C:\\Program Files (x86)\\Arduino\\hardware\\tools\\avr/bin/avr-gcc-ar" rcs "C:\\Users\\XXXXX\\AppData\\Local\\Temp\\arduino_build_601778\\core\\core.a" "C:\\Users\\XXXXX\\AppData\\Local\\Temp\\arduino_build_601778\\core\\Print.cpp.o"
"C:\\Program Files (x86)\\Arduino\\hardware\\tools\\avr/bin/avr-gcc-ar" rcs "C:\\Users\\XXXXX\\AppData\\Local\\Temp\\arduino_build_601778\\core\\core.a" "C:\\Users\\XXXXX\\AppData\\Local\\Temp\\arduino_build_601778\\core\\Stream.cpp.o​"
"C:\\Program Files (x86)\\Arduino\\hardware\\tools\\avr/bin/avr-gcc-ar" rcs "C:\\Users\\XXXXX\\AppData\\Local\\Temp\\arduino_build_601778\\core\\core.a" "C:\\Users\\XXXXX\\AppData\\Local\\Temp\\arduino_build_601778\\core\\Tone.cpp.o"
"C:\\Program Files (x86)\\Arduino\\hardware\\tools\\avr/bin/avr-gcc-ar" rcs "C:\\Users\\XXXXX\\AppData\\Local\\Temp\\arduino_build_601778\\core\\core.a" "C:\\Users\\XXXXX\\AppData\\Local\\Temp\\arduino_build_601778\\core\\USBCore.cpp.​o"
"C:\\Program Files (x86)\\Arduino\\hardware\\tools\\avr/bin/avr-gcc-ar" rcs "C:\\Users\\XXXXX\\AppData\\Local\\Temp\\arduino_build_601778\\core\\core.a" "C:\\Users\\XXXXX\\AppData\\Local\\Temp\\arduino_build_601778\\core\\WInterrupts.​c.o"
"C:\\Program Files (x86)\\Arduino\\hardware\\tools\\avr/bin/avr-gcc-ar" rcs "C:\\Users\\XXXXX\\AppData\\Local\\Temp\\arduino_build_601778\\core\\core.a" "C:\\Users\\XXXXX\\AppData\\Local\\Temp\\arduino_build_601778\\core\\WMath.cpp.o"
"C:\\Program Files (x86)\\Arduino\\hardware\\tools\\avr/bin/avr-gcc-ar" rcs "C:\\Users\\XXXXX\\AppData\\Local\\Temp\\arduino_build_601778\\core\\core.a" "C:\\Users\\XXXXX\\AppData\\Local\\Temp\\arduino_build_601778\\core\\WString.cpp.​o"
"C:\\Program Files (x86)\\Arduino\\hardware\\tools\\avr/bin/avr-gcc-ar" rcs "C:\\Users\\XXXXX\\AppData\\Local\\Temp\\arduino_build_601778\\core\\core.a" "C:\\Users\\XXXXX\\AppData\\Local\\Temp\\arduino_build_601778\\core\\abi.cpp.o"
"C:\\Program Files (x86)\\Arduino\\hardware\\tools\\avr/bin/avr-gcc-ar" rcs "C:\\Users\\XXXXX\\AppData\\Local\\Temp\\arduino_build_601778\\core\\core.a" "C:\\Users\\XXXXX\\AppData\\Local\\Temp\\arduino_build_601778\\core\\hooks.c.o"
"C:\\Program Files (x86)\\Arduino\\hardware\\tools\\avr/bin/avr-gcc-ar" rcs "C:\\Users\\XXXXX\\AppData\\Local\\Temp\\arduino_build_601778\\core\\core.a" "C:\\Users\\XXXXX\\AppData\\Local\\Temp\\arduino_build_601778\\core\\main.cpp.o"
"C:\\Program Files (x86)\\Arduino\\hardware\\tools\\avr/bin/avr-gcc-ar" rcs "C:\\Users\\XXXXX\\AppData\\Local\\Temp\\arduino_build_601778\\core\\core.a" "C:\\Users\\XXXXX\\AppData\\Local\\Temp\\arduino_build_601778\\core\\new.cpp.o"
"C:\\Program Files (x86)\\Arduino\\hardware\\tools\\avr/bin/avr-gcc-ar" rcs "C:\\Users\\XXXXX\\AppData\\Local\\Temp\\arduino_build_601778\\core\\core.a" "C:\\Users\\XXXXX\\AppData\\Local\\Temp\\arduino_build_601778\\core\\wiring.c.o"
"C:\\Program Files (x86)\\Arduino\\hardware\\tools\\avr/bin/avr-gcc-ar" rcs "C:\\Users\\XXXXX\\AppData\\Local\\Temp\\arduino_build_601778\\core\\core.a" "C:\\Users\\XXXXX\\AppData\\Local\\Temp\\arduino_build_601778\\core\\wiring_analo​g.c.o"
"C:\\Program Files (x86)\\Arduino\\hardware\\tools\\avr/bin/avr-gcc-ar" rcs "C:\\Users\\XXXXX\\AppData\\Local\\Temp\\arduino_build_601778\\core\\core.a" "C:\\Users\\XXXXX\\AppData\\Local\\Temp\\arduino_build_601778\\core\\wiring_digit​al.c.o"
"C:\\Program Files (x86)\\Arduino\\hardware\\tools\\avr/bin/avr-gcc-ar" rcs "C:\\Users\\XXXXX\\AppData\\Local\\Temp\\arduino_build_601778\\core\\core.a" "C:\\Users\\XXXXX\\AppData\\Local\\Temp\\arduino_build_601778\\core\\wiring_pulse​.S.o"
"C:\\Program Files (x86)\\Arduino\\hardware\\tools\\avr/bin/avr-gcc-ar" rcs "C:\\Users\\XXXXX\\AppData\\Local\\Temp\\arduino_build_601778\\core\\core.a" "C:\\Users\\XXXXX\\AppData\\Local\\Temp\\arduino_build_601778\\core\\wiring_pulse​.c.o"
"C:\\Program Files (x86)\\Arduino\\hardware\\tools\\avr/bin/avr-gcc-ar" rcs "C:\\Users\\XXXXX\\AppData\\Local\\Temp\\arduino_build_601778\\core\\core.a" "C:\\Users\\XXXXX\\AppData\\Local\\Temp\\arduino_build_601778\\core\\wiring_shift​.c.o"
Gebauter Kern wird archiviert (zwischengespeichert) in: C:\Users\XXXXX\AppData\Local\Temp\arduino_cache_496984\core\core_arduino_avr_nan​o_cpu_atmega328old_0c812875ac70eb4a9b385d8fb077f54c.a
Linking everything together...
"C:\\Program Files (x86)\\Arduino\\hardware\\tools\\avr/bin/avr-gcc" -w -Os -g -flto -fuse-linker-plugin -Wl,--gc-sections -mmcu=atmega328p -o "C:\\Users\\XXXXX\\AppData\\Local\\Temp\\arduino_build_601778/Blocksignal_Bruhnkaten.ino.elf" "C:\\Users\\XXXXX\\AppData\\Local\\Temp\\arduino_build_601778\\sketch\\Blocksigna​l_Bruhnkaten.ino.cpp.o" "C:\\Users\\XXXXX\\AppData\\Local\\Temp\\arduino_build_601778\\libraries\\Softwar​eSerial\\SoftwareSerial.cpp.o" "C:\\Users\\XXXXX\\AppData\\Local\\Temp\\arduino_build_601778/core\\core.a" "-LC:\\Users\\XXXXX\\AppData\\Local\\Temp\\arduino_build_601778" -lm
G:\Modellbahn\Elektronik\Bruhnkarten_Signale\Blocksignal_Bruhnkaten\Blocksignal_​Bruhnkaten.ino: In function '_GLOBAL__sub_I_bluetoothTx':

G:\Modellbahn\Elektronik\Bruhnkarten_Signale\Blocksignal_Bruhnkaten\Blocksignal_​Bruhnkaten.ino:162:1: internal compiler error: Segmentation fault

}//end-Action_01

^

Please submit a full bug report,

with preprocessed source if appropriate.

See <http://gcc.gnu.org/bugs.html> for instructions.

lto-wrapper.exe: fatal error: C:\Program Files (x86)\Arduino\hardware\tools\avr/bin/avr-gcc returned 1 exit status

compilation terminated.

c:/program files (x86)/arduino/hardware/tools/avr/bin/../lib/gcc/avr/5.4.0/../../../../avr/bin/ld.exe: error: lto-wrapper failed

collect2.exe: error: ld returned 1 exit status

Bibliothek SoftwareSerial in Version 1.0 im Ordner: C:\Program Files (x86)\Arduino\hardware\arduino\avr\libraries\SoftwareSerial wird verwendet
exit status 1
Fehler beim Kompilieren für das Board Arduino Nano.
Alle Beiträge dieses Benutzers finden
Diese Nachricht in einer Antwort zitieren
30.01.2020, 16:26
Beitrag #2
RE: plötzlich merkwürdige Fehlermeldung beim Übersetzen
Moin!

eben nochmal probiert und da kam dann nur noch

Zitat:avrdude: Version 6.3-20171130
Copyright © 2000-2005 Brian Dean, http://www.bdmicro.com/
Copyright © 2007-2014 Joerg Wunsch

System wide configuration file is "C:\Program Files (x86)\Arduino\hardware\tools\avr/etc/avrdude.conf"

Using Port : COM6
Using Programmer : arduino
Overriding Baud Rate : 57600
AVR Part : ATmega328P
Chip Erase delay : 9000 us
PAGEL : PD7
BS2 : PC2
RESET disposition : dedicated
RETRY pulse : SCK
serial program mode : yes
parallel program mode : yes
Timeout : 200
StabDelay : 100
CmdexeDelay : 25
SyncLoops : 32
ByteDelay : 0
PollIndex : 3
PollValue : 0x53
Memory Detail :

Block Poll Page Polled
Memory Type Mode Delay Size Indx Paged Size Size #Pages MinW MaxW ReadBack
----------- ---- ----- ----- ---- ------ ------ ---- ------ ----- ----- ---------
eeprom 65 20 4 0 no 1024 4 0 3600 3600 0xff 0xff
flash 65 6 128 0 yes 32768 128 256 4500 4500 0xff 0xff
lfuse 0 0 0 0 no 1 0 0 4500 4500 0x00 0x00
hfuse 0 0 0 0 no 1 0 0 4500 4500 0x00 0x00
efuse 0 0 0 0 no 1 0 0 4500 4500 0x00 0x00
lock 0 0 0 0 no 1 0 0 4500 4500 0x00 0x00
calibration 0 0 0 0 no 1 0 0 0 0 0x00 0x00
signature 0 0 0 0 no 3 0 0 0 0 0x00 0x00

Programmer Type : Arduino
Description : Arduino
Hardware Version: 2
Firmware Version: 1.16
Vtarget : 0.0 V
Varef : 0.0 V
Oscillator : Off
SCK period : 0.1 us

avrdude: AVR device initialized and ready to accept instructions

Reading | ################################################## | 100% 0.00s

avrdude: Device signature = 0x1e950f (probably m328p)
avrdude: reading input file "C:\Users\TAPPEN~1\AppData\Local\Temp\arduino_build_601778/Blocksignal_Bruhnkaten.ino.hex"
avrdude: writing flash (3654 bytes):

Writing | ################################################## | 100% 1.06s

avrdude: 3654 bytes of flash written
avrdude: verifying flash memory against C:\Users\TAPPEN~1\AppData\Local\Temp\arduino_build_601778/Blocksignal_Bruhnkaten.ino.hex:
avrdude: load data flash data from input file C:\Users\TAPPEN~1\AppData\Local\Temp\arduino_build_601778/Blocksignal_Bruhnkaten.ino.hex:
avrdude: input file C:\Users\TAPPEN~1\AppData\Local\Temp\arduino_build_601778/Blocksignal_Bruhnkaten.ino.hex contains 3654 bytes
avrdude: reading on-chip flash data:

Reading | ################################################## | 100% 0.81s

avrdude: verifying ...
avrdude: 3654 bytes of flash verified

avrdude done. Thank you.

Ob das nun wieder läuft muss ich später prüfen.

Jan
Alle Beiträge dieses Benutzers finden
Diese Nachricht in einer Antwort zitieren
30.01.2020, 16:29
Beitrag #3
RE: plötzlich merkwürdige Fehlermeldung beim Übersetzen
Das ist ein interner Speicherfahler des Kompilers. 2 Varianten:

1. IDE schließen - Löschen des ganzen Ordners C:\\Users\\XXXXX\\AppData\\Local\\Temp\\arduino_build_601778 - IDE starten neu versuchen

2. Die IDE Version 1.8.10 oder 1.8.11 (am Besten als portable IDE - davon kannst Du mehrere haben) installieren

Gruß Tommy

"Wer den schnellen Erfolg sucht, sollte nicht programmieren, sondern Holz hacken." (Quelle unbekannt)
Alle Beiträge dieses Benutzers finden
Diese Nachricht in einer Antwort zitieren
30.01.2020, 16:30 (Dieser Beitrag wurde zuletzt bearbeitet: 30.01.2020 16:34 von Jan99.)
Beitrag #4
RE: plötzlich merkwürdige Fehlermeldung beim Übersetzen
(30.01.2020 16:29)Tommy56 schrieb:  Das ist ein interner Speicherfahler des Kompilers. 2 Varianten:

1. IDE schließen - Löschen des ganzen Ordners C:\\Users\\XXXXX\\AppData\\Local\\Temp\\arduino_build_601778 - IDE starten neu versuchen

2. Die IDE Version 1.8.10 oder 1.8.11 (am Besten als portable IDE - davon kannst Du mehrere haben) installieren

Gruß Tommy

Moin!

danke - wollte gerade noch schreiben, dass es nach dem erfolgreichen Übersetzungsversuch dann wieder nicht geklappt hat.

Werde ich aber morgen nochmal ausprobieren.

Jan

Diesen lokalen Ordner kann ich nicht finden - vorher allerdings IDE geschlossen!
Alle Beiträge dieses Benutzers finden
Diese Nachricht in einer Antwort zitieren
30.01.2020, 16:45
Beitrag #5
RE: plötzlich merkwürdige Fehlermeldung beim Übersetzen
Dann ist er im Normalfall weg, aber bei Windows kann man sich da nie sicher sein.
Die 1.8.9 ist ja auch nicht mehr die Jüngste und ich kann mich schwach erinnern, dass die nicht stabil war.
Deshalb habe ich hier auch nur 1.6.5, 1.8.8, 3x1.8.10 (mit verschiedenen ESP8266 Versionen und verschiedenen Arduino-Versionen) und zum Testen 1.8.11.

Gruß Tommy

"Wer den schnellen Erfolg sucht, sollte nicht programmieren, sondern Holz hacken." (Quelle unbekannt)
Alle Beiträge dieses Benutzers finden
Diese Nachricht in einer Antwort zitieren
Antwort schreiben 


Möglicherweise verwandte Themen...
Thema: Verfasser Antworten: Ansichten: Letzter Beitrag
  Übersetzen und das Ergebnis ist unterschiedlich? SOFTHARD 4 389 21.07.2020 08:44
Letzter Beitrag: SOFTHARD
  Fehlermeldung expected unqualified-id before void Celestron 26 1.309 28.06.2020 18:19
Letzter Beitrag: Tommy56
  Fehlermeldung exec: "{runtime.tools.ctags.path}/ctags": file does not exist Celestron 11 830 28.06.2020 12:26
Letzter Beitrag: hotsystems
  433 MHz Transmitter SX1278: Merkwürdigkeit beim Empfang GuaAck 5 431 20.06.2020 22:20
Letzter Beitrag: hotsystems
  Fehlermeldung beim Sketch hochladen heino_m 12 1.218 28.05.2020 18:25
Letzter Beitrag: Tommy56
  Wo ist der RxD1 beim Wemos D1 mini? DO3GE 3 457 03.05.2020 12:33
Letzter Beitrag: Fips
  Verschiedene Spannungen beim Schalten von Relais? Wosch 4 539 19.04.2020 16:33
Letzter Beitrag: Tommy56
  Fehler beim Kompilieren Lunge 6 747 09.04.2020 14:07
Letzter Beitrag: MicroBahner
  Timeout beim Hochladen freak76 5 680 06.04.2020 08:54
Letzter Beitrag: GuaAck
  Undefined reference-Fehler beim Kompilieren MdE 9 898 24.03.2020 21:39
Letzter Beitrag: Tommy56

Gehe zu:


Benutzer, die gerade dieses Thema anschauen: 1 Gast/Gäste