INFO: Dieses Forum nutzt Cookies...
Cookies sind für den Betrieb des Forums unverzichtbar. Mit der Nutzung des Forums erklärst Du dich damit einverstanden, dass wir Cookies verwenden.

Es wird in jedem Fall ein Cookie gesetzt um diesen Hinweis nicht mehr zu erhalten. Desweiteren setzen wir Google Adsense und Google Analytics ein.

Antwort schreiben 
 
Themabewertung:
  • 0 Bewertungen - 0 im Durchschnitt
  • 1
  • 2
  • 3
  • 4
  • 5
Problem mit Netbeans
14.12.2014, 16:23
Beitrag #1
Problem mit Netbeans
Hallo,
ich hab nun alles angeschlossen was ich habe und auch soweit das Tuturial von ihm angesehen.
Aber wenn ich ab 10:15 das starte bekomme ich immer wieder diese meldung

Zitat:ant -f C:\\Users\\Shark\\Desktop\\Moppy-moppy-advanced\\Java\\MoppyDesk -Dnb.internal.action.name=run run
init:
Deleting: C:\Users\Shark\Desktop\Moppy-moppy-advanced\Java\MoppyDesk\build\built-jar.properties
deps-jar:
Updating property file: C:\Users\Shark\Desktop\Moppy-moppy-advanced\Java\MoppyDesk\build\built-jar.properties
Compiling 22 source files to C:\Users\Shark\Desktop\Moppy-moppy-advanced\Java\MoppyDesk\build\classes
warning: [options] bootstrap class path not set in conjunction with -source 1.5
warning: [options] source value 1.5 is obsolete and will be removed in a future release
warning: [options] target value 1.5 is obsolete and will be removed in a future release
warning: [options] To suppress warnings about obsolete options, use -Xlint:-options.
C:\Users\Shark\Desktop\Moppy-moppy-advanced\Java\MoppyDesk\src\moppydesk\MoppyUI.java:22: error: package org.jdesktop.application does not exist
import org.jdesktop.application.SingleFrameApplication;
C:\Users\Shark\Desktop\Moppy-moppy-advanced\Java\MoppyDesk\src\moppydesk\MoppyUI.java:28: error: cannot find symbol
public class MoppyUI extends SingleFrameApplication {
symbol: class SingleFrameApplication
C:\Users\Shark\Desktop\Moppy-moppy-advanced\Java\MoppyDesk\src\moppydesk\testing\MoppyFloppySim.java:17: error: package org.jdesktop.application does not exist
import org.jdesktop.application.SingleFrameApplication;
C:\Users\Shark\Desktop\Moppy-moppy-advanced\Java\MoppyDesk\src\moppydesk\testing\MoppyFloppySim.java:23: error: cannot find symbol
public class MoppyFloppySim extends SingleFrameApplication{
symbol: class SingleFrameApplication
C:\Users\Shark\Desktop\Moppy-moppy-advanced\Java\MoppyDesk\src\moppydesk\MoppyUI.java:40: error: method does not override or implement a method from a supertype
@Override
C:\Users\Shark\Desktop\Moppy-moppy-advanced\Java\MoppyDesk\src\moppydesk\MoppyUI.java:48: error: cannot find symbol
JOptionPane.showMessageDialog(this.getMainFrame(), ex.toString());
symbol: method getMainFrame()
C:\Users\Shark\Desktop\Moppy-moppy-advanced\Java\MoppyDesk\src\moppydesk\MoppyUI.java:52: error: cannot find symbol
show(mainWindow);
symbol: method show(MoppyControlWindow)
location: class MoppyUI
C:\Users\Shark\Desktop\Moppy-moppy-advanced\Java\MoppyDesk\src\moppydesk\MoppyUI.java:60: error: cannot find symbol
launch(MoppyUI.class, args);
symbol: method launch(Class<MoppyUI>,String[])
location: class MoppyUI
C:\Users\Shark\Desktop\Moppy-moppy-advanced\Java\MoppyDesk\src\moppydesk\testing\MoppyFloppySim.java:31: error: cannot find symbol
launch(MoppyFloppySim.class, args);
symbol: method launch(Class<MoppyFloppySim>,String[])
location: class MoppyFloppySim
C:\Users\Shark\Desktop\Moppy-moppy-advanced\Java\MoppyDesk\src\moppydesk\testing\MoppyFloppySim.java:34: error: method does not override or implement a method from a supertype
@Override
C:\Users\Shark\Desktop\Moppy-moppy-advanced\Java\MoppyDesk\src\moppydesk\testing\MoppyFloppySim.java:38: error: cannot find symbol
show(mainWindow);
symbol: method show(FloppySimWindow)
location: class MoppyFloppySim
Note: Some input files use unchecked or unsafe operations.
Note: Recompile with -Xlint:unchecked for details.
11 errors
4 warnings
C:\Users\Shark\Desktop\Moppy-moppy-advanced\Java\MoppyDesk\nbproject\build-impl.xml:923: The following error occurred while executing this line:
C:\Users\Shark\Desktop\Moppy-moppy-advanced\Java\MoppyDesk\nbproject\build-impl.xml:303: Compile failed; see the compiler error output for details.
BUILD FAILED (total time: 0 seconds)

Ich hab keine Ahnung was dies bedeutet


Link:
https://www.youtube.com/watch?v=BfFFL0tE-3s
Alle Beiträge dieses Benutzers finden
Diese Nachricht in einer Antwort zitieren
14.12.2014, 16:48
Beitrag #2
RE: Problem mit Netbeans
(14.12.2014 16:40)Zorg schrieb:  frag' doch den genialen Künstler des Oscar-verdächtigen Videos ;-)

Um eine richtige Antwort hätte ich von hier etwas mehr gefreut
Alle Beiträge dieses Benutzers finden
Diese Nachricht in einer Antwort zitieren
14.12.2014, 17:32
Beitrag #3
RE: Problem mit Netbeans
Wenn du dabei meinst was ich vorhabe, dass zeigt das Video.
Alle Beiträge dieses Benutzers finden
Diese Nachricht in einer Antwort zitieren
Antwort schreiben 


Möglicherweise verwandte Themen...
Thema: Verfasser Antworten: Ansichten: Letzter Beitrag
  Smart Home Webserver Basic Authentication Problem Osotastic 21 377 20.02.2017 18:00
Letzter Beitrag: Tommy56
  ESP8622 - 01 sendet UDP - Problem WLan Kriskind 33 1.593 11.02.2017 18:59
Letzter Beitrag: Tommy56
  Problem mit Sketch senden an Uno feuerwehr 5 330 31.01.2017 20:41
Letzter Beitrag: Tommy56
  Beim Hochladen USB Problem Nils 10 560 29.12.2016 21:05
Letzter Beitrag: renid55
  Problem mit SD Card Library BennIY 4 342 06.10.2016 18:38
Letzter Beitrag: Bitklopfer
  Problem mit SD.remove Eichner 6 296 22.08.2016 19:42
Letzter Beitrag: Eichner
  4x16 Tastermatrix Problem Michel 16 1.066 14.07.2016 10:02
Letzter Beitrag: StephanBuerger
  Problem mit Delay und Millis funnyzocker 1 624 26.06.2016 09:54
Letzter Beitrag: hotsystems
  Problem mit ESP8266 und EMail senden torsten_156 1 891 13.06.2016 21:14
Letzter Beitrag: torsten_156
  ESP8266_01 flashen - Problem torsten_156 12 1.368 30.05.2016 20:12
Letzter Beitrag: torsten_156

Gehe zu:


Benutzer, die gerade dieses Thema anschauen: 1 Gast/Gäste